Luchian Grigore Luchian Grigore - 3 months ago 12
C++ Question

What is an undefined reference/unresolved external symbol error and how do I fix it?

What are undefined reference/unresolved external symbol errors? What are common causes and how to fix/prevent them?

Feel free to edit/add your own.

Answer

Compiling a C++ program takes place in several steps, as specified by 2.2 (credits to Keith Thompson for the reference):

The precedence among the syntax rules of translation is specified by the following phases [see footnote].

  1. Physical source file characters are mapped, in an implementation-defined manner, to the basic source character set (introducing new-line characters for end-of-line indicators) if necessary. [SNIP]
  2. Each instance of a backslash character (\) immediately followed by a new-line character is deleted, splicing physical source lines to form logical source lines. [SNIP]
  3. The source file is decomposed into preprocessing tokens (2.5) and sequences of white-space characters (including comments). [SNIP]
  4. Preprocessing directives are executed, macro invocations are expanded, and _Pragma unary operator expressions are executed. [SNIP]
  5. Each source character set member in a character literal or a string literal, as well as each escape sequence and universal-character-name in a character literal or a non-raw string literal, is converted to the corresponding member of the execution character set; [SNIP]
  6. Adjacent string literal tokens are concatenated.
  7. White-space characters separating tokens are no longer significant. Each preprocessing token is converted into a token. (2.7). The resulting tokens are syntactically and semantically analyzed and translated as a translation unit. [SNIP]
  8. Translated translation units and instantiation units are combined as follows: [SNIP]
  9. All external entity references are resolved. Library components are linked to satisfy external references to entities not defined in the current translation. All such translator output is collected into a program image which contains information needed for execution in its execution environment. (emphasis mine)

[footnote] Implementations must behave as if these separate phases occur, although in practice different phases might be folded together.

The specified errors occur during this last stage of compilation, most commonly referred to as linking. It basically means that you compiled a bunch of implementation files into object files or libraries and now you want to get them to work together.

Say you defined symbol a in a.cpp. Now, b.cpp declared that symbol and used it. Before linking, it simply assumes that that symbol was defined somewhere, but it doesn't yet care where. The linking phase is responsible for finding the symbol and correctly linking it to b.cpp (well, actually to the object or library that uses it).

If you're using MSVS, you'll see that projects generate .lib files. These contain a table of exported symbols, and a table of imported symbols. The imported symbols are resolved against the libraries you link against, and the exported symbols are provided for the libraries that use that .lib (if any).

Similar mechanism exist for other compilers/platforms.

Common error messages are error LNK2001, error LNK1120, error LNK2019 for MSVS and undefined reference to symbolName for gcc.

The code:

struct X
{
   virtual void foo();
};
struct Y : X
{
   void foo() {}
};
struct A
{
   virtual ~A() = 0;
};
struct B: A
{
   virtual ~B(){}
};
extern int x;
void foo();
int main()
{
   x = 0;
   foo();
   Y y;
   B b;
}

would generate the following errors with gcc:

/home/AbiSfw/ccvvuHoX.o: In function `main':
prog.cpp:(.text+0x10): undefined reference to `x'
prog.cpp:(.text+0x19): undefined reference to `foo()'
prog.cpp:(.text+0x2d): undefined reference to `A::~A()'
/home/AbiSfw/ccvvuHoX.o: In function `B::~B()':
prog.cpp:(.text._ZN1BD1Ev[B::~B()]+0xb): undefined reference to `A::~A()'
/home/AbiSfw/ccvvuHoX.o: In function `B::~B()':
prog.cpp:(.text._ZN1BD0Ev[B::~B()]+0x12): undefined reference to `A::~A()'
/home/AbiSfw/ccvvuHoX.o:(.rodata._ZTI1Y[typeinfo for Y]+0x8): undefined reference to `typeinfo for X'
/home/AbiSfw/ccvvuHoX.o:(.rodata._ZTI1B[typeinfo for B]+0x8): undefined reference to `typeinfo for A'
collect2: ld returned 1 exit status

and similar errors with MSVS:

1>test2.obj : error LNK2001: unresolved external symbol "void __cdecl foo(void)" (?foo@@YAXXZ)
1>test2.obj : error LNK2001: unresolved external symbol "int x" (?x@@3HA)
1>test2.obj : error LNK2001: unresolved external symbol "public: virtual __thiscall A::~A(void)" (??1A@@UAE@XZ)
1>test2.obj : error LNK2001: unresolved external symbol "public: virtual void __thiscall X::foo(void)" (?foo@X@@UAEXXZ)
1>...\test2.exe : fatal error LNK1120: 4 unresolved externals

Common causes include:

Comments